Reaction Details
TargetAdenosine receptor A1
LigandBDBM50199268
Substrate/Competitorn/a
Meas. Tech.ChEMBL_412713 (CHEMBL908372)
Ki 9.6±n/a nM
Citation Kiesman, WFZhao, JConlon, PRDowling, JEPetter, RCLutterodt, FJin, XSmits, GFure, MJayaraj, AKim, JSullivan, GLinden, J Potent and orally bioavailable 8-bicyclo[2.2.2]octylxanthines as adenosine A1 receptor antagonists. J Med Chem49:7119-31 (2006) 
 
Adenosine receptor A1
Name:Adenosine receptor A1
Type:G Protein-Coupled Receptor (GPCR)
Mol. Mass.:36520.92
Organism:Homo sapiens (Human)
Description:P30542
Residue:326
BDBM50199268
NameBDBM50199268
Synonyms:(E)-3-[4-(2,6-dioxo-1,3-dipropyl-2,3,6,7-tetrahydro-1H-purin-8-yl)-bicyclo[2.2.2]oct-1-yl]-acrylic acid | CHEMBL217076
TypeSmall organic molecule
Emp. Form.C22H30N4O4
Mol. Mass.414.498
SMILESCCCn1c2nc([nH]c2c(=O)n(CCC)c1=O)[C@@]12CC[C@@](CC1)(CC2)\C=C\C(O)=O