Reaction Details
TargetAdenosine receptor A1
LigandBDBM50199281
Substrate/Competitorn/a
Meas. Tech.ChEMBL_412713 (CHEMBL908372)
Ki 16±n/a nM
Citation Kiesman, WFZhao, JConlon, PRDowling, JEPetter, RCLutterodt, FJin, XSmits, GFure, MJayaraj, AKim, JSullivan, GLinden, J Potent and orally bioavailable 8-bicyclo[2.2.2]octylxanthines as adenosine A1 receptor antagonists. J Med Chem49:7119-31 (2006) 
 
Adenosine receptor A1
Name:Adenosine receptor A1
Type:G Protein-Coupled Receptor (GPCR)
Mol. Mass.:36520.92
Organism:Homo sapiens (Human)
Description:P30542
Residue:326
BDBM50199281
NameBDBM50199281
Synonyms:8-(4-hydroxymethyl-bicyclo[2.2.2]oct-1-yl)-1,3-dipropyl-3,7-dihydro-purine-2,6-dione | CHEMBL438827
TypeSmall organic molecule
Emp. Form.C20H30N4O3
Mol. Mass.374.4772
SMILESCCCn1c2[nH]c(nc2c(=O)n(CCC)c1=O)[C@]12CC[C@](CO)(CC1)CC2