Reaction Details
TargetGlucagon receptor
LigandBDBM50199497
Substrate/Competitorn/a
Meas. Tech.ChEMBL_441038 (CHEMBL890125)
IC50 76.0±n/a nM
Citation Liang, RAbrardo, LBrady, EJCandelore, MRDing, VSaperstein, RTota, LMWright, MMock, STamvakopolous, CTong, SZheng, SZhang, BBTata, JRParmee, ER Design and synthesis of conformationally constrained tri-substituted ureas as potent antagonists of the human glucagon receptor. Bioorg Med Chem Lett17:587-92 (2007) 
 
Glucagon receptor
Name:Glucagon receptor
Type:Enzyme
Mol. Mass.:54026.92
Organism:Homo sapiens (Human)
Description:P47871
Residue:477
BDBM50199497
NameBDBM50199497
Synonyms:1-(7-((2H-tetrazol-5-yl)carbamoyl)-3,4-dihydro-2H-chromen-4-yl)-1-((1r,4r)-4-tert-butylcyclohexyl)-3-(4-(trifluoromethoxy)phenyl)urea | CHEMBL411832
TypeSmall organic molecule
Emp. Form.C29H34F3N7O4
Mol. Mass.601.62
SMILESCC(C)(C)[C@H]1CC[C@@H](CC1)N(C1CCOc2cc(ccc12)C(=O)Nc1nnn[nH]1)C(=O)Nc1ccc(OC(F)(F)F)cc1