Reaction Details
TargetGlucagon receptor
LigandBDBM50199489
Substrate/Competitorn/a
Meas. Tech.ChEMBL_441038 (CHEMBL890125)
IC50 218±n/a nM
Citation Liang, RAbrardo, LBrady, EJCandelore, MRDing, VSaperstein, RTota, LMWright, MMock, STamvakopolous, CTong, SZheng, SZhang, BBTata, JRParmee, ER Design and synthesis of conformationally constrained tri-substituted ureas as potent antagonists of the human glucagon receptor. Bioorg Med Chem Lett17:587-92 (2007) 
 
Glucagon receptor
Name:Glucagon receptor
Type:Enzyme
Mol. Mass.:54026.92
Organism:Homo sapiens (Human)
Description:P47871
Residue:477
BDBM50199489
NameBDBM50199489
Synonyms:3-(4-(1-((1r,4r)-4-tert-butylcyclohexyl)-3-(4-(trifluoromethoxy)phenyl)ureido)chroman-7-carboxamido)propanoic acid | CHEMBL395759
TypeSmall organic molecule
Emp. Form.C31H38F3N3O6
Mol. Mass.605.6451
SMILESCC(C)(C)[C@H]1CC[C@@H](CC1)N(C1CCOc2cc(ccc12)C(=O)NCCC(O)=O)C(=O)Nc1ccc(OC(F)(F)F)cc1