Reaction Details
TargetSeed linoleate 13S-lipoxygenase-1
LigandBDBM32020
Substrate/Competitorn/a
Meas. Tech.ChEMBL_432884 (CHEMBL915009)
IC50 1300±n/a nM
Citation Siskou, ICRekka, EAKourounakis, APChrysselis, MCTsiakitzis, KKourounakis, PN Design and study of some novel ibuprofen derivatives with potential nootropic and neuroprotective properties. Bioorg Med Chem15:951-61 (2006) 
 
Seed linoleate 13S-lipoxygenase-1
Name:Seed linoleate 13S-lipoxygenase-1
Type:Enzyme
Mol. Mass.:94365.66
Organism:Glycine max (soybean)
Description:n/a
Residue:839
BDBM32020
NameBDBM32020
Synonyms:4-[4-(3,4-dihydroxyphenyl)-2,3-dimethyl-butyl]pyrocatechol 4-[4-[3,4-bis(oxidanyl)phenyl]-2,3-dimethyl-butyl]benzene-1,2-diol CHEMBL52 MLS000069451 Nordihydroguaiaretic acid (NDGA) US10857082, Compound 2.18 | cid_4534
TypeSmall organic molecule
Emp. Form.C18H22O4
Mol. Mass.302.3649
SMILESCC(Cc1ccc(O)c(O)c1)C(C)Cc1ccc(O)c(O)c1