Reaction Details
TargetAcetylcholinesterase
LigandBDBM50199531
Substrate/Competitorn/a
Meas. Tech.ChEMBL_441060 (CHEMBL890218)
pH5±n/a
IC50 1173±n/a nM
Commentsextracted
Citation He, XCFeng, SWang, ZFShi, YZheng, SXia, YJiang, HTang, XCBai, D Study on dual-site inhibitors of acetylcholinesterase: Highly potent derivatives of bis- and bifunctional huperzine B. Bioorg Med Chem15:1394-408 (2007) 
 
Acetylcholinesterase
Name:Acetylcholinesterase
Type:Enzyme
Mol. Mass.:68193.62
Organism:Rattus norvegicus (rat)
Description:P37136
Residue:614
BDBM50199531
NameBDBM50199531
Synonyms:1-[16-methyl-5-oxo-6,14-diazatetracyclo[7.5.3.01,10.02,7]heptadeca-2(7),3,16-trien-14-yl]-2-(4-{2-[16-methyl-5-oxo-6,14-diazatetracyclo[7.5.3.01,10.02,7]heptadeca-2(7),3,16-trien-14-yl]-2-oxoethyl}hexahydro-1-pyrazinyl)-1-ethanone N,N'-bis(1-oxo-8,15-didehydrolycodinocarbonylmethyl)-piperazine
TypeSmall organic molecule
Emp. Form.C40H50N6O4
Mol. Mass.678.8628
SMILESCC1=C[C@H]2Cc3[nH]c(=O)ccc3[C@@]3(C1)[C@@H]2CCCN3C(=O)CN1CCN(CC(=O)N2CCC[C@@H]3[C@@H]4Cc5[nH]c(=O)ccc5[C@]23CC(C)=C4)CC1