Reaction Details
TargetAcetylcholinesterase
LigandBDBM50199545
Substrate/Competitorn/a
Meas. Tech.ChEMBL_441060 (CHEMBL890218)
pH5±n/a
IC50 33.6±n/a nM
Commentsextracted
Citation He, XCFeng, SWang, ZFShi, YZheng, SXia, YJiang, HTang, XCBai, D Study on dual-site inhibitors of acetylcholinesterase: Highly potent derivatives of bis- and bifunctional huperzine B. Bioorg Med Chem15:1394-408 (2007) 
 
Acetylcholinesterase
Name:Acetylcholinesterase
Type:Enzyme
Mol. Mass.:68193.62
Organism:Rattus norvegicus (rat)
Description:P37136
Residue:614
BDBM50199545
NameBDBM50199545
Synonyms:CHEMBL413170 | N,N'-dimethyl-N,N'-bis[3-(1-oxo-8,15-didehydrolycodino)propyl]-1,6-hexanediamine
TypeSmall organic molecule
Emp. Form.C46H68N6O2
Mol. Mass.737.0711
SMILESCN(CCCCCCN(C)CCCN1CCC[C@@H]2[C@@H]3Cc4[nH]c(=O)ccc4[C@]12CC(C)=C3)CCCN1CCC[C@@H]2[C@@H]3Cc4[nH]c(=O)ccc4[C@]12CC(C)=C3