Reaction Details
TargetCarboxylic ester hydrolase
LigandBDBM50199520
Substrate/Competitorn/a
Meas. Tech.ChEMBL_441061 (CHEMBL891276)
IC50 63000±n/a nM
Citation He, XCFeng, SWang, ZFShi, YZheng, SXia, YJiang, HTang, XCBai, D Study on dual-site inhibitors of acetylcholinesterase: Highly potent derivatives of bis- and bifunctional huperzine B. Bioorg Med Chem15:1394-408 (2007) 
 
Carboxylic ester hydrolase
Name:Carboxylic ester hydrolase
Type:Enzyme
Mol. Mass.:67776.22
Organism:Rattus norvegicus (rat)
Description:n/a
Residue:597
BDBM50199520
NameBDBM50199520
Synonyms:CHEMBL397232 | N,N'-dimethyl-N,N'-bis[2-(1-oxo-8,15-didehydrolycodinocarbonyl)ethyl]-1,8-octanediamine
TypeSmall organic molecule
Emp. Form.C48H68N6O4
Mol. Mass.793.0913
SMILESCN(CCCCCCCCN(C)CCC(=O)N1CCC[C@@H]2[C@@H]3Cc4[nH]c(=O)ccc4[C@]12CC(C)=C3)CCC(=O)N1CCC[C@@H]2[C@@H]3Cc4[nH]c(=O)ccc4[C@]12CC(C)=C3