Reaction Details
TargetAcetylcholinesterase
LigandBDBM50199551
Substrate/Competitorn/a
Meas. Tech.ChEMBL_441060 (CHEMBL890218)
pH5±n/a
IC50 50.8±n/a nM
Commentsextracted
Citation He, XCFeng, SWang, ZFShi, YZheng, SXia, YJiang, HTang, XCBai, D Study on dual-site inhibitors of acetylcholinesterase: Highly potent derivatives of bis- and bifunctional huperzine B. Bioorg Med Chem15:1394-408 (2007) 
 
Acetylcholinesterase
Name:Acetylcholinesterase
Type:Enzyme
Mol. Mass.:68193.62
Organism:Rattus norvegicus (rat)
Description:P37136
Residue:614
BDBM50199551
NameBDBM50199551
Synonyms:CHEMBL395282 | N,N'-dimethyl-N,N'-bis(1-oxo-8,15-didehydrolycodinocarbonylmethyl)-1,8-octanediamine
TypeSmall organic molecule
Emp. Form.C46H64N6O4
Mol. Mass.765.0382
SMILESCN(CCCCCCCCN(C)CC(=O)N1CCC[C@@H]2[C@@H]3Cc4[nH]c(=O)ccc4[C@]12CC(C)=C3)CC(=O)N1CCC[C@@H]2[C@@H]3Cc4[nH]c(=O)ccc4[C@]12CC(C)=C3