Reaction Details
Target5-hydroxytryptamine receptor 1B
LigandBDBM50199558
Substrate/Competitorn/a
Meas. Tech.ChEMBL_432902 (CHEMBL915028)
Ki 9.3±n/a nM
Citation Horchler, CLMcCauley, JPHall, JESnyder, DHCraig Moore, WHudzik, TJChapdelaine, MJ Synthesis of novel quinolone and quinoline-2-carboxylic acid (4-morpholin-4-yl-phenyl)amides: a late-stage diversification approach to potent 5HT1B antagonists. Bioorg Med Chem15:939-50 (2006) 
 
5-hydroxytryptamine receptor 1B
Name:5-hydroxytryptamine receptor 1B
Type:G Protein-Coupled Receptor (GPCR)
Mol. Mass.:43579.17
Organism:Homo sapiens (Human)
Description:Receptor binding assays were performed using human clone stably expressed in CHO cells
Residue:390
BDBM50199558
NameBDBM50199558
Synonyms:6-fluoro-8-(4-methyl-piperazin-1-yl)-4-oxo-1,4-dihydroquinoline-2-carboxylic acid (4-morpholin-4-ylphenyl)amide | CHEMBL225363
TypeSmall organic molecule
Emp. Form.C25H28FN5O3
Mol. Mass.465.5199
SMILESCN1CCN(CC1)c1cc(F)cc2c(O)cc(nc12)C(=O)Nc1ccc(cc1)N1CCOCC1