Reaction Details
Target5-hydroxytryptamine receptor 1B
LigandBDBM50199565
Substrate/Competitorn/a
Meas. Tech.ChEMBL_432902 (CHEMBL915028)
Ki 30±n/a nM
Citation Horchler, CLMcCauley, JPHall, JESnyder, DHCraig Moore, WHudzik, TJChapdelaine, MJ Synthesis of novel quinolone and quinoline-2-carboxylic acid (4-morpholin-4-yl-phenyl)amides: a late-stage diversification approach to potent 5HT1B antagonists. Bioorg Med Chem15:939-50 (2006) 
 
5-hydroxytryptamine receptor 1B
Name:5-hydroxytryptamine receptor 1B
Type:G Protein-Coupled Receptor (GPCR)
Mol. Mass.:43579.17
Organism:Homo sapiens (Human)
Description:Receptor binding assays were performed using human clone stably expressed in CHO cells
Residue:390
BDBM50199565
NameBDBM50199565
Synonyms:6-fluoro-4-methoxy-8-(4-methyl-piperazin-1-yl)-quinoline-2-carboxylic acid (4-morpholin-4-yl-phenyl)amide | CHEMBL224267
TypeSmall organic molecule
Emp. Form.C26H30FN5O3
Mol. Mass.479.5465
SMILESCOc1cc(nc2c(cc(F)cc12)N1CCN(C)CC1)C(=O)Nc1ccc(cc1)N1CCOCC1