Reaction Details
TargetSodium-dependent serotonin transporter
LigandBDBM50199594
Substrate/Competitorn/a
Meas. Tech.ChEMBL_453432 (CHEMBL885431)
Ki 5.3±n/a nM
Citation Letavic, MAKeith, JMJablonowski, JAStocking, EMGomez, LALy, KSMiller, JMBarbier, AJBonaventure, PBoggs, JDWilson, SJMiller, KLLord, BMcAllister, HMTognarelli, DJWu, JAbad, MCSchubert, CLovenberg, TWCarruthers, NI Novel tetrahydroisoquinolines are histamine H3 antagonists and serotonin reuptake inhibitors. Bioorg Med Chem Lett17:1047-51 (2007) 
 
Sodium-dependent serotonin transporter
Name:Sodium-dependent serotonin transporter
Type:Multi-pass membrane protein
Mol. Mass.:70168.43
Organism:Rattus norvegicus (rat)
Description:P31652
Residue:630
BDBM50199594
NameBDBM50199594
Synonyms:4-(3-chloro-4-methoxyphenyl)-7-(3-(4-fluoropiperidin-1-yl)propoxy)-2-methyl-1,2,3,4-tetrahydroisoquinoline | CHEMBL246331
TypeSmall organic molecule
Emp. Form.C25H32ClFN2O2
Mol. Mass.446.985
SMILESCOc1ccc(cc1Cl)C1CN(C)Cc2cc(OCCCN3CCC(F)CC3)ccc12