Reaction Details
TargetSodium-dependent serotonin transporter
LigandBDBM50199593
Substrate/Competitorn/a
Meas. Tech.ChEMBL_453432 (CHEMBL885431)
Ki 2.00±n/a nM
Citation Letavic, MAKeith, JMJablonowski, JAStocking, EMGomez, LALy, KSMiller, JMBarbier, AJBonaventure, PBoggs, JDWilson, SJMiller, KLLord, BMcAllister, HMTognarelli, DJWu, JAbad, MCSchubert, CLovenberg, TWCarruthers, NI Novel tetrahydroisoquinolines are histamine H3 antagonists and serotonin reuptake inhibitors. Bioorg Med Chem Lett17:1047-51 (2007) 
 
Sodium-dependent serotonin transporter
Name:Sodium-dependent serotonin transporter
Type:Multi-pass membrane protein
Mol. Mass.:70168.43
Organism:Rattus norvegicus (rat)
Description:P31652
Residue:630
BDBM50199593
NameBDBM50199593
Synonyms:7-(3-(4-fluoropiperidin-1-yl)propoxy)-2-methyl-4-(4-(methylthio)phenyl)-1,2,3,4-tetrahydroisoquinoline | CHEMBL395368
TypeSmall organic molecule
Emp. Form.C25H33FN2OS
Mol. Mass.428.606
SMILESCSc1ccc(cc1)C1CN(C)Cc2cc(OCCCN3CCC(F)CC3)ccc12