Reaction Details
TargetSodium-dependent serotonin transporter
LigandBDBM50199602
Substrate/Competitorn/a
Meas. Tech.ChEMBL_453432 (CHEMBL885431)
Ki 5±n/a nM
Citation Letavic, MAKeith, JMJablonowski, JAStocking, EMGomez, LALy, KSMiller, JMBarbier, AJBonaventure, PBoggs, JDWilson, SJMiller, KLLord, BMcAllister, HMTognarelli, DJWu, JAbad, MCSchubert, CLovenberg, TWCarruthers, NI Novel tetrahydroisoquinolines are histamine H3 antagonists and serotonin reuptake inhibitors. Bioorg Med Chem Lett17:1047-51 (2007) 
 
Sodium-dependent serotonin transporter
Name:Sodium-dependent serotonin transporter
Type:Multi-pass membrane protein
Mol. Mass.:70168.43
Organism:Rattus norvegicus (rat)
Description:P31652
Residue:630
BDBM50199602
NameBDBM50199602
Synonyms:(S)-4-(4-methoxyphenyl)-2-methyl-7-(3-((S)-3-methylmorpholino)propoxy)-1,2,3,4-tetrahydroisoquinoline | CHEMBL395609
TypeSmall organic molecule
Emp. Form.C25H34N2O3
Mol. Mass.410.5491
SMILESCOc1ccc(cc1)[C@@H]1CN(C)Cc2cc(OCCCN3CCOC[C@@H]3C)ccc12