Reaction Details
TargetSodium-dependent serotonin transporter
LigandBDBM50199597
Substrate/Competitorn/a
Meas. Tech.ChEMBL_453432 (CHEMBL885431)
Ki 2.30±n/a nM
Citation Letavic, MAKeith, JMJablonowski, JAStocking, EMGomez, LALy, KSMiller, JMBarbier, AJBonaventure, PBoggs, JDWilson, SJMiller, KLLord, BMcAllister, HMTognarelli, DJWu, JAbad, MCSchubert, CLovenberg, TWCarruthers, NI Novel tetrahydroisoquinolines are histamine H3 antagonists and serotonin reuptake inhibitors. Bioorg Med Chem Lett17:1047-51 (2007) 
 
Sodium-dependent serotonin transporter
Name:Sodium-dependent serotonin transporter
Type:Multi-pass membrane protein
Mol. Mass.:70168.43
Organism:Rattus norvegicus (rat)
Description:P31652
Residue:630
BDBM50199597
NameBDBM50199597
Synonyms:2-methyl-4-(4-(methylthio)phenyl)-7-(3-morpholinopropoxy)-1,2,3,4-tetrahydroisoquinoline | CHEMBL246955
TypeSmall organic molecule
Emp. Form.C24H32N2O2S
Mol. Mass.412.588
SMILESCSc1ccc(cc1)C1CN(C)Cc2cc(OCCCN3CCOCC3)ccc12