Reaction Details
TargetCaspase-1
LigandBDBM50199763
Substrate/Competitorn/a
Meas. Tech.ChEMBL_441110 (CHEMBL891324)
IC50 2±n/a nM
Citation Wang, YO'Neil, SVWos, JAOppong, KALaufersweiler, MCSoper, DLEllis, CDBaize, MWFancher, ANLu, WSuchanek, MKWang, RLSchwecke, WPCruze, CABuchalova, MBelkin, MDe, BDemuth, TP Synthesis and evaluation of unsaturated caprolactams as interleukin-1beta converting enzyme (ICE) inhibitors. Bioorg Med Chem15:1311-22 (2007) 
 
Caspase-1
Name:Caspase-1
Type:Enzyme
Mol. Mass.:45154.13
Organism:Homo sapiens (Human)
Description:P29466
Residue:404
BDBM50199763
NameBDBM50199763
Synonyms:CHEMBL397184 | N-((S,Z)-6-(benzamidomethyl)-1-(2-((3S)-2-hydroxy-5-oxo-tetrahydrofuran-3-ylamino)-2-oxoethyl)-2-oxo-2,3,4,7-tetrahydro-1H-azepin-3-yl)-2-naphthamide
TypeSmall organic molecule
Emp. Form.C31H30N4O7
Mol. Mass.570.5925
SMILESOC1OC(=O)C[C@@H]1NC(=O)CN1CC(CNC(=O)c2ccccc2)=CC[C@H](NC(=O)c2ccc3ccccc3c2)C1=O