Reaction Details
TargetCaspase-1
LigandBDBM50199768
Substrate/Competitorn/a
Meas. Tech.ChEMBL_441110 (CHEMBL891324)
IC50 3±n/a nM
Citation Wang, YO'Neil, SVWos, JAOppong, KALaufersweiler, MCSoper, DLEllis, CDBaize, MWFancher, ANLu, WSuchanek, MKWang, RLSchwecke, WPCruze, CABuchalova, MBelkin, MDe, BDemuth, TP Synthesis and evaluation of unsaturated caprolactams as interleukin-1beta converting enzyme (ICE) inhibitors. Bioorg Med Chem15:1311-22 (2007) 
 
Caspase-1
Name:Caspase-1
Type:Enzyme
Mol. Mass.:45154.13
Organism:Homo sapiens (Human)
Description:P29466
Residue:404
BDBM50199768
NameBDBM50199768
Synonyms:(S)-3-((4S,7S,11aS,Z)-7-(isoquinoline-1-carboxamido)-6-oxo-1,3,4,6,7,8,11,11a-octahydro-[1,4]oxazino[4,3-a]azocine-4-carboxamido)-4-oxobutanoic acid | CHEMBL242298
TypeSmall organic molecule
Emp. Form.C25H26N4O7
Mol. Mass.494.4965
SMILESOC(=O)C[C@H](NC(=O)[C@@H]1COC[C@@H]2C\C=C/C[C@H](NC(=O)c3nccc4ccccc34)C(=O)N12)C=O