Reaction Details
TargetAndrogen receptor
LigandBDBM50199965
Substrate/Competitorn/a
Meas. Tech.ChEMBL_422453 (CHEMBL911023)
IC50 42.7±n/a nM
Citation Larsson, AEriksson, LAAndersson, PLIvarson, POlsson, PE Identification of the brominated flame retardant 1,2-dibromo-4-(1,2-dibromoethyl)cyclohexane as an androgen agonist. J Med Chem49:7366-72 (2006) 
 
Androgen receptor
Name:Androgen receptor
Type:Receptor
Mol. Mass.:99185.27
Organism:Homo sapiens (Human)
Description:CHO cells were stably transfected with human AR gene.
Residue:920
BDBM50199965
NameBDBM50199965
Synonyms:1,2-dibromo-4-(1,2-dibromoethyl)cyclohexane | CHEMBL375107
TypeSmall organic molecule
Emp. Form.C8H12Br4
Mol. Mass.427.797
SMILESBrCC(Br)C1CCC(Br)C(Br)C1