Reaction Details
TargetAdenosine receptor A3
LigandBDBM50199970
Substrate/Competitorn/a
Meas. Tech.ChEMBL_422428 (CHEMBL909840)
Ki 2.8±n/a nM
Citation Cosyn, LPalaniappan, KKKim, SKDuong, HTGao, ZGJacobson, KAVan Calenbergh, S 2-triazole-substituted adenosines: a new class of selective A3 adenosine receptor agonists, partial agonists, and antagonists. J Med Chem49:7373-83 (2006) 
 
Adenosine receptor A3
Name:Adenosine receptor A3
Type:G Protein-Coupled Receptor (GPCR)
Mol. Mass.:36197.32
Organism:Homo sapiens (Human)
Description:P0DMS8
Residue:318
BDBM50199970
NameBDBM50199970
Synonyms:9-(5-ethylcarbamoyl-beta-D-ribofuranosyl)-N6-methyl-2-(4-benzyl-1,2,3-triazol-1-yl)adenine | CHEMBL385582
TypeSmall organic molecule
Emp. Form.C22H25N9O4
Mol. Mass.479.4918
SMILESCCNC(=O)[C@H]1O[C@H]([C@H](O)[C@@H]1O)n1cnc2c(NC)nc(nc12)-n1cc(Cc2ccccc2)nn1