Reaction Details
TargetD(4) dopamine receptor
LigandBDBM50200029
Substrate/Competitorn/a
Meas. Tech.ChEMBL_422483 (CHEMBL910435)
Ki 17±n/a nM
Citation Patel, MVKolasa, TMortell, KMatulenko, MAHakeem, AARohde, JJNelson, SLCowart, MDNakane, MMiller, LNUchic, METerranova, MAEl-Kouhen, OFDonnelly-Roberts, DLNamovic, MTHollingsworth, PRChang, RMartino, BRWetter, JMMarsh, KCMartin, RDarbyshire, JFGintant, GHsieh, GCMoreland, RBSullivan, JPBrioni, JDStewart, AO Discovery of 3-methyl-N-(1-oxy-3',4',5',6'-tetrahydro-2'H-[2,4'-bipyridine]-1'-ylmethyl)benzamide (ABT-670), an orally bioavailable dopamine D4 agonist for the treatment of erectile dysfunction. J Med Chem49:7450-65 (2006) 
 
D(4) dopamine receptor
Name:D(4) dopamine receptor
Type:Enzyme
Mol. Mass.:48373.19
Organism:Homo sapiens (Human)
Description:P21917
Residue:419
BDBM50200029
NameBDBM50200029
Synonyms:6-(4-((1H-benzo[d]imidazol-2-yl)methyl)piperazin-1-yl)pyridin-3-ol CHEMBL219179
TypeSmall organic molecule
Emp. Form.C17H19N5O
Mol. Mass.309.3657
SMILESOc1ccc(nc1)N1CCN(Cc2nc3ccccc3[nH]2)CC1