Reaction Details
TargetTyrosine-protein kinase CSK
LigandBDBM50200187
Substrate/Competitorn/a
Meas. Tech.ChEMBL_422673 (CHEMBL913341)
IC50 3200±n/a nM
Citation Gu, XWang, YKumar, AYe, GParang, KSun, G Design and evaluation of hydroxamate derivatives as metal-mediated inhibitors of a protein tyrosine kinase. J Med Chem49:7532-9 (2006) 
 
Tyrosine-protein kinase CSK
Name:Tyrosine-protein kinase CSK
Type:Tyrosine-protein kinase
Mol. Mass.:50707.30
Organism:Homo sapiens (Human)
Description:P41240
Residue:450
BDBM50200187
NameBDBM50200187
Synonyms:(S)-2-amino-N-hydroxy-3-(4-iodophenyl)propanamide | CHEMBL219500
TypeSmall organic molecule
Emp. Form.C9H11IN2O2
Mol. Mass.306.1003
SMILESN[C@@H](Cc1ccc(I)cc1)C(=O)NO