Reaction Details
TargetTyrosine-protein kinase CSK
LigandBDBM50200189
Substrate/Competitorn/a
Meas. Tech.ChEMBL_422673 (CHEMBL913341)
IC50 4900±n/a nM
Citation Gu, XWang, YKumar, AYe, GParang, KSun, G Design and evaluation of hydroxamate derivatives as metal-mediated inhibitors of a protein tyrosine kinase. J Med Chem49:7532-9 (2006) 
 
Tyrosine-protein kinase CSK
Name:Tyrosine-protein kinase CSK
Type:Tyrosine-protein kinase
Mol. Mass.:50707.30
Organism:Homo sapiens (Human)
Description:P41240
Residue:450
BDBM50200189
NameBDBM50200189
Synonyms:(S)-2-amino-N-hydroxy-3-[4-(nitrophenyl)phenyl]propanamide | CHEMBL219449
TypeSmall organic molecule
Emp. Form.C15H15N3O4
Mol. Mass.301.2973
SMILESN[C@@H](Cc1ccc(cc1)-c1ccc(cc1)[N+]([O-])=O)C(=O)NO