Reaction Details
TargetTyrosine-protein kinase CSK
LigandBDBM50200208
Substrate/Competitorn/a
Meas. Tech.ChEMBL_422673 (CHEMBL913341)
IC50 3300±n/a nM
Citation Gu, XWang, YKumar, AYe, GParang, KSun, G Design and evaluation of hydroxamate derivatives as metal-mediated inhibitors of a protein tyrosine kinase. J Med Chem49:7532-9 (2006) 
 
Tyrosine-protein kinase CSK
Name:Tyrosine-protein kinase CSK
Type:Tyrosine-protein kinase
Mol. Mass.:50707.30
Organism:Homo sapiens (Human)
Description:P41240
Residue:450
BDBM50200208
NameBDBM50200208
Synonyms:(S)-2-amino-N-hydroxy-3-(4-isopropylphenyl)propanamide | CHEMBL218768
TypeSmall organic molecule
Emp. Form.C12H18N2O2
Mol. Mass.222.2835
SMILESCC(C)c1ccc(C[C@H](N)C(=O)NO)cc1