Reaction Details
TargetVascular endothelial growth factor receptor 2
LigandBDBM47167
Substrate/Competitorn/a
Meas. Tech.ChEMBL_420183 (CHEMBL912726)
IC50 2.5±n/a nM
Citation Peifer, CKrasowski, AHämmerle, NKohlbacher, ODannhardt, GTotzke, FSchächtele, CLaufer, S Profile and molecular modeling of 3-(indole-3-yl)-4-(3,4,5-trimethoxyphenyl)-1 H-pyrrole-2,5-dione (1) as a highly selective VEGF-R2/3 inhibitor. J Med Chem49:7549-53 (2006) 
 
Vascular endothelial growth factor receptor 2
Name:Vascular endothelial growth factor receptor 2
Type:Receptor Tyrosine Kinase
Mol. Mass.:151510.97
Organism:Homo sapiens (Human)
Description:P35968
Residue:1356
BDBM47167
NameBDBM47167
Synonyms:CHEMBL201511 US9364459, A
Typen/a
Emp. Form.C21H18N2O5
Mol. Mass.378.378
SMILESCOc1cc(cc(OC)c1OC)C1=C(C(=O)NC1=O)c1c[nH]c2ccccc12