Reaction Details
TargetProstaglandin D2 receptor 2
LigandBDBM50200262
Substrate/Competitorn/a
Meas. Tech.ChEMBL_408429 (CHEMBL908864)
IC50 3.4±n/a nM
Citation Ulven, TReceveur, JMGrimstrup, MRist, ØFrimurer, TMGerlach, LOMathiesen, JMKostenis, EUller, LHögberg, T Novel selective orally active CRTH2 antagonists for allergic inflammation developed from in silico derived hits. J Med Chem49:6638-41 (2006) 
 
Prostaglandin D2 receptor 2
Name:Prostaglandin D2 receptor 2
Type:Enzyme
Mol. Mass.:43295.45
Organism:Homo sapiens (Human)
Description:Q9Y5Y4
Residue:395
BDBM50200262
NameBDBM50200262
Synonyms:4-bromo-2-[1-(3-bromophenyl)-1H-pyrazole-4-carbonyl]phenoxyacetic acid | CHEMBL385472
TypeSmall organic molecule
Emp. Form.C18H12Br2N2O4
Mol. Mass.480.107
SMILESOC(=O)COc1ccc(Br)cc1C(=O)c1cnn(c1)-c1cccc(Br)c1