Reaction Details
TargetCaspase-3
LigandBDBM50200303
Substrate/Competitorn/a
Meas. Tech.ChEMBL_408840 (CHEMBL909955)
Ki 9±n/a nM
Citation Kopka, KFaust, AKeul, PWagner, SBreyholz, HJHöltke, CSchober, OSchäfers, MLevkau, B 5-pyrrolidinylsulfonyl isatins as a potential tool for the molecular imaging of caspases in apoptosis. J Med Chem49:6704-15 (2006) 
 
Caspase-3
Name:Caspase-3
Type:Hydrolase; heterotetramer of two heterodimers
Mol. Mass.:31607.55
Organism:Homo sapiens (Human)
Description:n/a
Residue:277
BDBM50200303
NameBDBM50200303
Synonyms:(S)-1-(4-methoxybenzyl)-5-[1-(2-methoxymethylpyrrolidinyl)-sulfonyl]isatin | CHEMBL217777
TypeSmall organic molecule
Emp. Form.C22H24N2O6S
Mol. Mass.444.501
SMILESCOC[C@@H]1CCCN1S(=O)(=O)c1ccc2N(Cc3ccc(OC)cc3)C(=O)C(=O)c2c1