Reaction Details
TargetCaspase-3
LigandBDBM50192784
Substrate/Competitorn/a
Meas. Tech.ChEMBL_408840 (CHEMBL909955)
Ki 0.2±n/a nM
Citation Kopka, KFaust, AKeul, PWagner, SBreyholz, HJHöltke, CSchober, OSchäfers, MLevkau, B 5-pyrrolidinylsulfonyl isatins as a potential tool for the molecular imaging of caspases in apoptosis. J Med Chem49:6704-15 (2006) 
 
Caspase-3
Name:Caspase-3
Type:Hydrolase; heterotetramer of two heterodimers
Mol. Mass.:31607.55
Organism:Homo sapiens (Human)
Description:n/a
Residue:277
BDBM50192784
NameBDBM50192784
Synonyms:(S)-1-(4-(2-fluoroethoxy)benzyl)-5-(2-(phenoxymethyl)pyrrolidin-1-ylsulfonyl)indoline-2,3-dione 1-[4-(2-fluoroethoxy)-benzyl]-5-(2-phenoxymethyl-pyrrolidine-1-sulfonyl)-1H-indole-2,3-dione | CHEMBL213759
TypeSmall organic molecule
Emp. Form.C28H27FN2O6S
Mol. Mass.538.587
SMILESFCCOc1ccc(CN2C(=O)C(=O)c3cc(ccc23)S(=O)(=O)N2CCC[C@H]2COc2ccccc2)cc1