Reaction Details
TargetSodium-dependent serotonin transporter
LigandBDBM50200323
Substrate/Competitorn/a
Meas. Tech.ChEMBL_409349 (CHEMBL912350)
Ki 0.2±n/a nM
Citation Stehouwer, JSJarkas, NZeng, FVoll, RJWilliams, LOwens, MJVotaw, JRGoodman, MM Synthesis, radiosynthesis, and biological evaluation of carbon-11 labeled 2beta-carbomethoxy-3beta-(3'-((Z)-2-haloethenyl)phenyl)nortropanes: candidate radioligands for in vivo imaging of the serotonin transporter with positron emission tomography. J Med Chem49:6760-7 (2006) 
 
Sodium-dependent serotonin transporter
Name:Sodium-dependent serotonin transporter
Type:Multi-pass membrane protein
Mol. Mass.:70322.51
Organism:Homo sapiens (Human)
Description:P31645
Residue:630
BDBM50200323
NameBDBM50200323
Synonyms:2beta-carbomethoxy-3beta-(3'-((Z)-2-bromoethenyl)phenyl)nortropane | CHEMBL385173
TypeSmall organic molecule
Emp. Form.C17H20BrNO2
Mol. Mass.350.25
SMILESCOC(=O)[C@@H]1C2CCC(C[C@@H]1c1cccc(\C=C\Br)c1)N2