Reaction Details
TargetAurora kinase A
LigandBDBM50200393
Substrate/Competitorn/a
Meas. Tech.ChEMBL_420194 (CHEMBL856401)
IC50 931±n/a nM
Citation Tari, LWHoffman, IDBensen, DCHunter, MJNix, JNelson, KJMcRee, DESwanson, RV Structural basis for the inhibition of Aurora A kinase by a novel class of high affinity disubstituted pyrimidine inhibitors. Bioorg Med Chem Lett17:688-91 (2007) 
 
Aurora kinase A
Name:Aurora kinase A
Type:Serine/threonine-protein kinase
Mol. Mass.:45830.98
Organism:Homo sapiens (Human)
Description:O14965
Residue:403
BDBM50200393
NameBDBM50200393
Synonyms:CHEMBL216260 | N-3-2-3-trifluoromethyl)phenylamino)pyrimidin-4-ylamino)phenyl)cyclopropanecarboxamide
TypeSmall organic molecule
Emp. Form.C21H18F3N5O
Mol. Mass.413.3957
SMILESFC(F)(F)c1cccc(Nc2nccc(Nc3cccc(NC(=O)C4CC4)c3)n2)c1