Reaction Details
TargetPeroxisome proliferator-activated receptor alpha
LigandBDBM50200410
Substrate/Competitorn/a
Meas. Tech.ChEMBL_453680 (CHEMBL885681)
EC50 641±n/a nM
Citation Cantin, LDLiang, SOgutu, HIwuagwu, CIBoakye, KBullock, WHBurns, MClark, RClaus, TdelaCruz, FEDaly, MEhrgott, FJJohnson, JSKeiper, CLivingston, JNSchoenleber, RWShapiro, JTown, CYang, LTsutsumi, MMa, X Indanylacetic acid derivatives carrying aryl-pyridyl and aryl-pyrimidinyl tail groups--new classes of PPAR gamma/delta and PPAR alpha/gamma/delta agonists. Bioorg Med Chem Lett17:1056-61 (2007) 
 
Peroxisome proliferator-activated receptor alpha
Name:Peroxisome proliferator-activated receptor alpha
Type:Enzyme
Mol. Mass.:52222.08
Organism:Homo sapiens (Human)
Description:Q07869
Residue:468
BDBM50200410
NameBDBM50200410
Synonyms:(S)-2-(5-(3-((2-(4-tert-butylphenyl)-5-methylpyrimidin-4-yl)(methyl)amino)propoxy)-2,3-dihydro-1H-inden-1-yl)acetic acid | CHEMBL239561
TypeSmall organic molecule
Emp. Form.C30H37N3O3
Mol. Mass.487.6331
SMILESCN(CCCOc1ccc2[C@H](CC(O)=O)CCc2c1)c1nc(ncc1C)-c1ccc(cc1)C(C)(C)C