Reaction Details
TargetPeroxisome proliferator-activated receptor alpha
LigandBDBM50200406
Substrate/Competitorn/a
Meas. Tech.ChEMBL_453680 (CHEMBL885681)
EC50 120±n/a nM
Citation Cantin, LDLiang, SOgutu, HIwuagwu, CIBoakye, KBullock, WHBurns, MClark, RClaus, TdelaCruz, FEDaly, MEhrgott, FJJohnson, JSKeiper, CLivingston, JNSchoenleber, RWShapiro, JTown, CYang, LTsutsumi, MMa, X Indanylacetic acid derivatives carrying aryl-pyridyl and aryl-pyrimidinyl tail groups--new classes of PPAR gamma/delta and PPAR alpha/gamma/delta agonists. Bioorg Med Chem Lett17:1056-61 (2007) 
 
Peroxisome proliferator-activated receptor alpha
Name:Peroxisome proliferator-activated receptor alpha
Type:Enzyme
Mol. Mass.:52222.08
Organism:Homo sapiens (Human)
Description:Q07869
Residue:468
BDBM50200406
NameBDBM50200406
Synonyms:(S)-2-(5-(3-((5-ethyl-2-(4-ethylphenyl)pyrimidin-4-yl)(methyl)amino)propoxy)-2,3-dihydro-1H-inden-1-yl)acetic acid | CHEMBL240437
TypeSmall organic molecule
Emp. Form.C29H35N3O3
Mol. Mass.473.6065
SMILESCCc1ccc(cc1)-c1ncc(CC)c(n1)N(C)CCCOc1ccc2[C@H](CC(O)=O)CCc2c1