Reaction Details
TargetPeroxisome proliferator-activated receptor alpha
LigandBDBM50200417
Substrate/Competitorn/a
Meas. Tech.ChEMBL_453680 (CHEMBL885681)
EC50 421±n/a nM
Citation Cantin, LDLiang, SOgutu, HIwuagwu, CIBoakye, KBullock, WHBurns, MClark, RClaus, TdelaCruz, FEDaly, MEhrgott, FJJohnson, JSKeiper, CLivingston, JNSchoenleber, RWShapiro, JTown, CYang, LTsutsumi, MMa, X Indanylacetic acid derivatives carrying aryl-pyridyl and aryl-pyrimidinyl tail groups--new classes of PPAR gamma/delta and PPAR alpha/gamma/delta agonists. Bioorg Med Chem Lett17:1056-61 (2007) 
 
Peroxisome proliferator-activated receptor alpha
Name:Peroxisome proliferator-activated receptor alpha
Type:Enzyme
Mol. Mass.:52222.08
Organism:Homo sapiens (Human)
Description:Q07869
Residue:468
BDBM50200417
NameBDBM50200417
Synonyms:2-((S)-5-(3-(5-(4-ethylthiazol-2-yl)pyridin-2-yloxy)propoxy)-2,3-dihydro-1H-inden-1-yl)acetic acid | CHEMBL240868
TypeSmall organic molecule
Emp. Form.C24H26N2O4S
Mol. Mass.438.539
SMILESCCc1csc(n1)-c1ccc(OCCCOc2ccc3[C@H](CC(O)=O)CCc3c2)nc1