Reaction Details
TargetPeroxisome proliferator-activated receptor delta
LigandBDBM50200403
Substrate/Competitorn/a
Meas. Tech.ChEMBL_453682 (CHEMBL885683)
IC50 610±n/a nM
Citation Cantin, LDLiang, SOgutu, HIwuagwu, CIBoakye, KBullock, WHBurns, MClark, RClaus, TdelaCruz, FEDaly, MEhrgott, FJJohnson, JSKeiper, CLivingston, JNSchoenleber, RWShapiro, JTown, CYang, LTsutsumi, MMa, X Indanylacetic acid derivatives carrying aryl-pyridyl and aryl-pyrimidinyl tail groups--new classes of PPAR gamma/delta and PPAR alpha/gamma/delta agonists. Bioorg Med Chem Lett17:1056-61 (2007) 
 
Peroxisome proliferator-activated receptor delta
Name:Peroxisome proliferator-activated receptor delta
Type:PROTEIN
Mol. Mass.:49719.14
Organism:Mus musculus
Description:ChEMBL_1288931
Residue:440
BDBM50200403
NameBDBM50200403
Synonyms:(S)-2-(5-(3-((2-(4-isopropylphenyl)-5-methylpyrimidin-4-yl)(methyl)amino)propoxy)-2,3-dihydro-1H-inden-1-yl)acetic acid | CHEMBL239353
TypeSmall organic molecule
Emp. Form.C29H35N3O3
Mol. Mass.473.6065
SMILESCC(C)c1ccc(cc1)-c1ncc(C)c(n1)N(C)CCCOc1ccc2[C@H](CC(O)=O)CCc2c1