Reaction Details
TargetPeroxisome proliferator-activated receptor gamma
LigandBDBM50200410
Substrate/Competitorn/a
Meas. Tech.ChEMBL_453678 (CHEMBL885679)
EC50 156±n/a nM
Citation Cantin, LDLiang, SOgutu, HIwuagwu, CIBoakye, KBullock, WHBurns, MClark, RClaus, TdelaCruz, FEDaly, MEhrgott, FJJohnson, JSKeiper, CLivingston, JNSchoenleber, RWShapiro, JTown, CYang, LTsutsumi, MMa, X Indanylacetic acid derivatives carrying aryl-pyridyl and aryl-pyrimidinyl tail groups--new classes of PPAR gamma/delta and PPAR alpha/gamma/delta agonists. Bioorg Med Chem Lett17:1056-61 (2007) 
 
Peroxisome proliferator-activated receptor gamma
Name:Peroxisome proliferator-activated receptor gamma
Type:PROTEIN
Mol. Mass.:57593.55
Organism:Mus musculus
Description:ChEMBL_1453700
Residue:505
BDBM50200410
NameBDBM50200410
Synonyms:(S)-2-(5-(3-((2-(4-tert-butylphenyl)-5-methylpyrimidin-4-yl)(methyl)amino)propoxy)-2,3-dihydro-1H-inden-1-yl)acetic acid | CHEMBL239561
TypeSmall organic molecule
Emp. Form.C30H37N3O3
Mol. Mass.487.6331
SMILESCN(CCCOc1ccc2[C@H](CC(O)=O)CCc2c1)c1nc(ncc1C)-c1ccc(cc1)C(C)(C)C