Reaction Details
TargetNociceptin receptor
LigandBDBM50200610
Substrate/Competitorn/a
Meas. Tech.ChEMBL_453746 (CHEMBL885746)
Ki 3±n/a nM
Citation Palin, RBom, AClark, JKEvans, LFeilden, HHoughton, AKJones, PSMontgomery, BWeston, MAWishart, G Synthesis and evaluation of N-3 substituted phenoxypropyl piperidine benzimidazol-2-one analogues as NOP receptor agonists with analgesic and sedative properties. Bioorg Med Chem15:1828-47 (2007) 
 
Nociceptin receptor
Name:Nociceptin receptor
Type:G Protein-Coupled Receptor (GPCR)
Mol. Mass.:40702.87
Organism:Homo sapiens (Human)
Description:P41146
Residue:370
BDBM50200610
NameBDBM50200610
Synonyms:1-{1-[3-(5-methoxy-2-methyl-phenoxy)-4-methylpentyl]-piperidin-4-yl}-3-(2-oxo-butyl)-1,3-dihydro-benzimidazol-2-one | CHEMBL239260
TypeSmall organic molecule
Emp. Form.C30H41N3O4
Mol. Mass.507.6642
SMILESCCC(=O)Cn1c2ccccc2n(C2CCN(CCC(Oc3cc(OC)ccc3C)C(C)C)CC2)c1=O