Reaction Details
TargetNociceptin receptor
LigandBDBM50200588
Substrate/Competitorn/a
Meas. Tech.ChEMBL_453746 (CHEMBL885746)
Ki 4±n/a nM
Citation Palin, RBom, AClark, JKEvans, LFeilden, HHoughton, AKJones, PSMontgomery, BWeston, MAWishart, G Synthesis and evaluation of N-3 substituted phenoxypropyl piperidine benzimidazol-2-one analogues as NOP receptor agonists with analgesic and sedative properties. Bioorg Med Chem15:1828-47 (2007) 
 
Nociceptin receptor
Name:Nociceptin receptor
Type:G Protein-Coupled Receptor (GPCR)
Mol. Mass.:40702.87
Organism:Homo sapiens (Human)
Description:P41146
Residue:370
BDBM50200588
NameBDBM50200588
Synonyms:(3-{1-[3-(5-methoxy-2-methyl-phenoxy)-4-methylpentyl]-piperidin-4-yl}-2-oxo-2,3-dihydro-benzimidazol-1-yl)-acetic acid methyl ester | CHEMBL238637
TypeSmall organic molecule
Emp. Form.C29H39N3O5
Mol. Mass.509.6371
SMILESCOC(=O)Cn1c2ccccc2n(C2CCN(CCC(Oc3cc(OC)ccc3C)C(C)C)CC2)c1=O