Reaction Details
TargetHistamine H3 receptor
LigandBDBM50200647
Substrate/Competitorn/a
Meas. Tech.ChEMBL_453775 (CHEMBL885776)
Ki 2.48±n/a nM
Citation Black, LANersesian, DLSharma, PKu, YYBennani, YLMarsh, KCMiller, TREsbenshade, TAHancock, AACowart, M 4-[6-(2-Aminoethyl)naphthalen-2-yl]benzonitriles are potent histamine H3 receptor antagonists with high CNS penetration. Bioorg Med Chem Lett17:1443-6 (2007) 
 
Histamine H3 receptor
Name:Histamine H3 receptor
Type:G Protein-Coupled Receptor (GPCR)
Mol. Mass.:48607.98
Organism:Rattus norvegicus (rat)
Description:n/a
Residue:445
BDBM50200647
NameBDBM50200647
Synonyms:(R)-4-(6-(2-(2-methylpyrrolidin-1-yl)ethyl)naphthalen-2-yl)benzonitrile | CHEMBL248155
TypeSmall organic molecule
Emp. Form.C24H24N2
Mol. Mass.340.4608
SMILESC[C@@H]1CCCN1CCc1ccc2cc(ccc2c1)-c1ccc(cc1)C#N