Reaction Details
TargetHistamine H3 receptor
LigandBDBM50200642
Substrate/Competitorn/a
Meas. Tech.ChEMBL_453774 (CHEMBL885775)
Ki 0.12±n/a nM
Citation Black, LANersesian, DLSharma, PKu, YYBennani, YLMarsh, KCMiller, TREsbenshade, TAHancock, AACowart, M 4-[6-(2-Aminoethyl)naphthalen-2-yl]benzonitriles are potent histamine H3 receptor antagonists with high CNS penetration. Bioorg Med Chem Lett17:1443-6 (2007) 
 
Histamine H3 receptor
Name:Histamine H3 receptor
Type:G Protein-Coupled Receptor (GPCR)
Mol. Mass.:48691.47
Organism:Homo sapiens (Human)
Description:Binding assays were using CHO cells stably expressing hH3R receptors.
Residue:445
BDBM50200642
NameBDBM50200642
Synonyms:(S)-4-(6-(2-(2-methylpyrrolidin-1-yl)ethyl)naphthalen-2-yl)benzonitrile | CHEMBL247505
TypeSmall organic molecule
Emp. Form.C24H24N2
Mol. Mass.340.4608
SMILESC[C@H]1CCCN1CCc1ccc2cc(ccc2c1)-c1ccc(cc1)C#N