Reaction Details
TargetHistamine H3 receptor
LigandBDBM50200635
Substrate/Competitorn/a
Meas. Tech.ChEMBL_453774 (CHEMBL885775)
Ki 10.5±n/a nM
Citation Black, LANersesian, DLSharma, PKu, YYBennani, YLMarsh, KCMiller, TREsbenshade, TAHancock, AACowart, M 4-[6-(2-Aminoethyl)naphthalen-2-yl]benzonitriles are potent histamine H3 receptor antagonists with high CNS penetration. Bioorg Med Chem Lett17:1443-6 (2007) 
 
Histamine H3 receptor
Name:Histamine H3 receptor
Type:G Protein-Coupled Receptor (GPCR)
Mol. Mass.:48691.47
Organism:Homo sapiens (Human)
Description:Binding assays were using CHO cells stably expressing hH3R receptors.
Residue:445
BDBM50200635
NameBDBM50200635
Synonyms:4-(6-(2-hydroxy-2-(methylamino)ethyl)naphthalen-2-yl)benzonitrile | CHEMBL246940
TypeSmall organic molecule
Emp. Form.C20H18N2O
Mol. Mass.302.3697
SMILESCNC(O)Cc1ccc2cc(ccc2c1)-c1ccc(cc1)C#N