Reaction Details
TargetMelanin-concentrating hormone receptor 1
LigandBDBM50200748
Substrate/Competitorn/a
Meas. Tech.ChEMBL_421482 (CHEMBL854911)
Ki 11±n/a nM
Citation Meyers, KMMéndez-Andino, JColson, AOHu, XEWos, JAMitchell, MCHodge, KHoward, JParis, JLDowty, MEObringer, CMReizes, O Novel pyrazolopiperazinone- and pyrrolopiperazinone-based MCH-R1 antagonists. Bioorg Med Chem Lett17:657-61 (2007) 
 
Melanin-concentrating hormone receptor 1
Name:Melanin-concentrating hormone receptor 1
Type:G Protein-Coupled Receptor (GPCR)
Mol. Mass.:45976.27
Organism:Homo sapiens (Human)
Description:Membranes from CHO-K1 cells stably expressing human MCH1R were used in assays.
Residue:422
BDBM50200748
NameBDBM50200748
Synonyms:1-(4-(piperidin-1-ylmethyl)phenethyl)-4-phenethylpiperazin-2-one CHEMBL217637
TypeSmall organic molecule
Emp. Form.C26H35N3O
Mol. Mass.405.5756
SMILESO=C1CN(CCc2ccccc2)CCN1CCc1ccc(CN2CCCCC2)cc1