Reaction Details
TargetCaspase-8
LigandBDBM50200932
Substrate/Competitorn/a
Meas. Tech.ChEMBL_423904 (CHEMBL913578)
Ki 540±n/a nM
Citation Henzing, AJDodson, HReid, JMKaufmann, SHBaxter, RLEarnshaw, WC Synthesis of novel caspase inhibitors for characterization of the active caspase proteome in vitro and in vivo. J Med Chem49:7636-45 (2006) 
 
Caspase-8
Name:Caspase-8
Type:Enzyme
Mol. Mass.:55373.89
Organism:Homo sapiens (Human)
Description:Q14790
Residue:479
BDBM50200932
NameBDBM50200932
Synonyms:(3S)-3-[(2S)-6-(6-{5-[(3aS,6aR)-2-oxo-hexahydro-1H-thieno[3,4-d]imidazolidin-4-yl]pentanamido}hexanamido)-2-[(2S)-2-{[(benzyloxy)carbonyl]amino}-4-carboxybutanamido]hexanamido]-5-[(2,6-dimethylphenyl)carbonyloxy]-4-oxopentanoic acid | CHEMBL221870
TypeSmall organic molecule
Emp. Form.C49H67N7O14S
Mol. Mass.1010.16
SMILESCc1cccc(C)c1C(=O)OCC(=O)[C@H](CC(O)=O)NC(=O)[C@H](CCCCNC(=O)CCCCCNC(=O)CCCCC1SC[C@@H]2NC(=O)N[C@H]12)NC(=O)[C@H](CCC(O)=O)NC(=O)OCc1ccccc1