Reaction Details
TargetGag-Pol polyprotein [489-587]
LigandBDBM50200956
Substrate/Competitorn/a
Meas. Tech.ChEMBL_422734 (CHEMBL854830)
Ki 14±n/a nM
Citation Whiting, MTripp, JCLin, YCLindstrom, WOlson, AJElder, JHSharpless, KBFokin, VV Rapid discovery and structure-activity profiling of novel inhibitors of human immunodeficiency virus type 1 protease enabled by the copper(I)-catalyzed synthesis of 1,2,3-triazoles and their further functionalization. J Med Chem49:7697-710 (2006) 
 
Gag-Pol polyprotein [489-587]
Name:Gag-Pol polyprotein [489-587]
Type:Enzyme Subunit
Mol. Mass.:10781.16
Organism:Human immunodeficiency virus type 1
Description:P04585[489-587]
Residue:99
BDBM50200956
NameBDBM50200956
Synonyms:CHEMBL262496 | cyclopentyl (2S,3S)-3-[4-([4-(2,5-dimethylphenyl)piperazin-1-yl]methyl)-5-(hydroxymethyl)-1H-1,2,3-triazol-1-yl]-1,4-diphenylbutan-2-ylcarbamate
TypeSmall organic molecule
Emp. Form.C38H48N6O3
Mol. Mass.636.8261
SMILESCc1ccc(C)c(c1)N1CCN(Cc2nnn([C@@H](Cc3ccccc3)[C@H](Cc3ccccc3)NC(=O)OC3CCCC3)c2CO)CC1