Reaction Details
TargetBcl-2-like protein 2
LigandBDBM50200964
Substrate/Competitorn/a
Meas. Tech.ChEMBL_422737 (CHEMBL909833)
Ki 30810±n/a nM
Citation Doshi, JMTian, DXing, C Structure-activity relationship studies of ethyl 2-amino-6-bromo-4-(1-cyano-2-ethoxy-2-oxoethyl)-4H-chromene-3-carboxylate (HA 14-1), an antagonist for antiapoptotic Bcl-2 proteins to overcome drug resistance in cancer. J Med Chem49:7731-9 (2006) 
 
Bcl-2-like protein 2
Name:Bcl-2-like protein 2
Type:Protein
Mol. Mass.:20742.61
Organism:Homo sapiens (Human)
Description:n/a
Residue:193
BDBM50200964
NameBDBM50200964
Synonyms:CHEMBL219234 | ethyl 2-amino-6-cyclopentyl-4-(1-cyano-2-ethoxy-2-oxoethyl)-4H-chromene-3-carboxylate
TypeSmall organic molecule
Emp. Form.C22H26N2O5
Mol. Mass.398.4522
SMILESCCOC(=O)C(C#N)C1C(C(=O)OCC)C(=N)Oc2ccc(cc12)C1CCCC1