Reaction Details
TargetThymidine phosphorylase
LigandBDBM50201010
Substrate/Competitorn/a
Meas. Tech.ChEMBL_422808 (CHEMBL856524)
Ki 236±n/a nM
Citation Allan, ALGladstone, PLPrice, MLHopkins, SAJuarez, JCDoñate, FTernansky, RJShaw, DEGanem, BLi, YWang, WEalick, S Synthesis and evaluation of multisubstrate bicyclic pyrimidine nucleoside inhibitors of human thymidine phosphorylase. J Med Chem49:7807-15 (2006) 
 
Thymidine phosphorylase
Name:Thymidine phosphorylase
Type:Enzyme
Mol. Mass.:49948.87
Organism:Homo sapiens (Human)
Description:The recombinant human thymidine phosphorylase (V79TP) was expressed in V79 Chinese hamster cells (Sigma, T-9319).
Residue:482
BDBM50201010
NameBDBM50201010
Synonyms:((2R,3aR,4R,6R,6aR)-4-(hydroxymethyl)-6-(5-methyl-2,4-dioxo-3,4-dihydropyrimidin-1(2H)-yl)-tetrahydrofuro[3,4-d][1,3]dioxol-2-yl)methylphosphonic acid CHEMBL374140
TypeSmall organic molecule
Emp. Form.C12H17N2O9P
Mol. Mass.364.2451
SMILESCc1cn([C@@H]2O[C@H](CO)[C@H]3O[C@@H](CP(O)(O)=O)O[C@@H]23)c(=O)[nH]c1=O