Reaction Details
TargetThymidine phosphorylase
LigandBDBM50201015
Substrate/Competitorn/a
Meas. Tech.ChEMBL_422808 (CHEMBL856524)
Ki 8030±n/a nM
Citation Allan, ALGladstone, PLPrice, MLHopkins, SAJuarez, JCDoñate, FTernansky, RJShaw, DEGanem, BLi, YWang, WEalick, S Synthesis and evaluation of multisubstrate bicyclic pyrimidine nucleoside inhibitors of human thymidine phosphorylase. J Med Chem49:7807-15 (2006) 
 
Thymidine phosphorylase
Name:Thymidine phosphorylase
Type:Enzyme
Mol. Mass.:49948.87
Organism:Homo sapiens (Human)
Description:The recombinant human thymidine phosphorylase (V79TP) was expressed in V79 Chinese hamster cells (Sigma, T-9319).
Residue:482
BDBM50201015
NameBDBM50201015
Synonyms:((2R,3aR,4R,6R,6aS)-6-(hydroxymethyl)-4-(5-methyl-2,4-dioxo-3,4-dihydropyrimidin-1(2H)-yl)-hexahydrofuro[3,4-b]furan-2-yl)methylphosphonic acid | CHEMBL376491
TypeSmall organic molecule
Emp. Form.C13H19N2O8P
Mol. Mass.362.2723
SMILESCc1cn([C@@H]2O[C@H](CO)[C@H]3O[C@@H](CP(O)(O)=O)C[C@@H]23)c(=O)[nH]c1=O