Reaction Details
TargetPotassium voltage-gated channel subfamily H member 2
LigandBDBM50197113
Substrate/Competitorn/a
Meas. Tech.ChEMBL_420606 (CHEMBL854891)
IC50 15000±n/a nM
Citation Souers, AJIyengar, RRJudd, ASBeno, DWGao, JZhao, GBrune, MENapier, JJMulhern, MMLynch, JKFreeman, JCWodka, DChen, CJFalls, HDBrodjian, SDayton, BDDiaz, GJBush, ENShapiro, RDroz, BAKnourek-Segel, VHernandez, LEMarsh, KCReilly, RMSham, HLCollins, CAKym, PR Constrained 7-fluorocarboxychromone-4-aminopiperidine based Melanin-concentrating hormone receptor 1 antagonists: the effects of chirality on substituted indan-1-ylamines. Bioorg Med Chem Lett17:884-9 (2007) 
 
Potassium voltage-gated channel subfamily H member 2
Name:Potassium voltage-gated channel subfamily H member 2
Type:Multi-pass membrane protein
Mol. Mass.:126672.65
Organism:Homo sapiens (Human)
Description:Q12809
Residue:1159
BDBM50197113
NameBDBM50197113
Synonyms:CHEMBL214731 N-[1-(1,3-benzodioxol-5-ylmethyl)piperidin-4-yl]-6-fluoro-4-oxo-4H-chromene-2-carboxamide
TypeSmall organic molecule
Emp. Form.C23H21FN2O5
Mol. Mass.424.4216
SMILESFc1ccc2oc(cc(=O)c2c1)C(=O)NC1CCN(Cc2ccc3OCOc3c2)CC1