Reaction Details
TargetMelanin-concentrating hormone receptor 1
LigandBDBM50201273
Substrate/Competitorn/a
Meas. Tech.ChEMBL_421480 (CHEMBL854909)
IC50 5±n/a nM
Citation Souers, AJIyengar, RRJudd, ASBeno, DWGao, JZhao, GBrune, MENapier, JJMulhern, MMLynch, JKFreeman, JCWodka, DChen, CJFalls, HDBrodjian, SDayton, BDDiaz, GJBush, ENShapiro, RDroz, BAKnourek-Segel, VHernandez, LEMarsh, KCReilly, RMSham, HLCollins, CAKym, PR Constrained 7-fluorocarboxychromone-4-aminopiperidine based Melanin-concentrating hormone receptor 1 antagonists: the effects of chirality on substituted indan-1-ylamines. Bioorg Med Chem Lett17:884-9 (2007) 
 
Melanin-concentrating hormone receptor 1
Name:Melanin-concentrating hormone receptor 1
Type:G Protein-Coupled Receptor (GPCR)
Mol. Mass.:45976.27
Organism:Homo sapiens (Human)
Description:Membranes from CHO-K1 cells stably expressing human MCH1R were used in assays.
Residue:422
BDBM50201273
NameBDBM50201273
Synonyms:CHEMBL214585 | N-(1-(6,7-dihydro-5H-indeno[5,6-d][1,3]dioxol-5-yl)piperidin-4-yl)-6-fluoro-4-oxo-4H-chromene-2-carboxamide
TypeSmall organic molecule
Emp. Form.C25H23FN2O5
Mol. Mass.450.4589
SMILESFc1ccc2oc(cc(=O)c2c1)C(=O)NC1CCN(CC1)C1CCc2cc3OCOc3cc12