Reaction Details
TargetMuscarinic acetylcholine receptor M3
LigandBDBM50201277
Substrate/Competitorn/a
Meas. Tech.ChEMBL_441418 (CHEMBL891647)
Ki 2.1±n/a nM
Citation Sonda, SKatayama, KFujio, MSakashita, HInaba, KAsano, KAkira, T 1,5-Benzodioxepin derivatives as a novel class of muscarinic M3 receptor antagonists. Bioorg Med Chem Lett17:925-31 (2007) 
 
Muscarinic acetylcholine receptor M3
Name:Muscarinic acetylcholine receptor M3
Type:Enzyme
Mol. Mass.:66151.03
Organism:Homo sapiens (Human)
Description:P20309
Residue:590
BDBM50201277
NameBDBM50201277
Synonyms:(4-(2-((3-(dimethylamino)-3,4-dihydro-2H-benzo[b][1,4]dioxepin-3-yl)methylamino)ethyl)cyclohexyl)methanol | CHEMBL234258
TypeSmall organic molecule
Emp. Form.C21H34N2O3
Mol. Mass.362.5063
SMILESCN(C)C1(CNCCC2CCC(CO)CC2)COc2ccccc2OC1