Reaction Details
TargetMuscarinic acetylcholine receptor M3
LigandBDBM50201276
Substrate/Competitorn/a
Meas. Tech.ChEMBL_441418 (CHEMBL891647)
Ki 5.8±n/a nM
Citation Sonda, SKatayama, KFujio, MSakashita, HInaba, KAsano, KAkira, T 1,5-Benzodioxepin derivatives as a novel class of muscarinic M3 receptor antagonists. Bioorg Med Chem Lett17:925-31 (2007) 
 
Muscarinic acetylcholine receptor M3
Name:Muscarinic acetylcholine receptor M3
Type:Enzyme
Mol. Mass.:66151.03
Organism:Homo sapiens (Human)
Description:P20309
Residue:590
BDBM50201276
NameBDBM50201276
Synonyms:3-((2-(3,6-dihydro-2H-thiopyran-4-yl)ethylamino)methyl)-N,N-dimethyl-3,4-dihydro-2H-benzo[b][1,4]dioxepin-3-amine | CHEMBL233202
TypeSmall organic molecule
Emp. Form.C19H28N2O2S
Mol. Mass.348.503
SMILESCN(C)C1(CNCCC2=CCSCC2)COc2ccccc2OC1