Reaction Details
TargetD(1A) dopamine receptor
LigandBDBM50201337
Substrate/Competitorn/a
Meas. Tech.ChEMBL_453884 (CHEMBL885886)
Ki 2±n/a nM
Citation Enzensperger, CKilian, SAckermann, MKoch, AKelch, KLehmann, J Dopamine/serotonin receptor ligands. Part 15: Oxygenation of the benz-indolo-azecine LE 300 leads to novel subnanomolar dopamine D1/D5 antagonists. Bioorg Med Chem Lett17:1399-402 (2007) 
 
D(1A) dopamine receptor
Name:D(1A) dopamine receptor
Type:Enzyme
Mol. Mass.:49303.43
Organism:Homo sapiens (Human)
Description:P21728
Residue:446
BDBM50201337
NameBDBM50201337
Synonyms:11-methoxy-7,14-dimethyl-6,7,8,9,14,15-hexahydro-5Hindolo[3,2-f][3]benzazecine | CHEMBL245764
TypeSmall organic molecule
Emp. Form.C22H26N2O
Mol. Mass.334.4546
SMILESCOc1ccc2n(C)c3Cc4ccccc4CCN(C)CCc3c2c1